{"text_format":"1","workbook":"xlsx","n_sheets":10,"sheets":["Setup","DrawPrep","Draw32","PrgPrep","Day1","Day2","MyProgram","DrawPoints","tmp","tmpRankings"],"not_rendered":{"charts":0,"images":0,"macros":1,"external_links":0,"defined_names":1,"comments":1,"pivot_tables":0},"unopened":[],"bounds":{"document_bytes":16777216,"sheet_cells":100000,"rows_first":2000,"rows_last":500,"rows_between":2000,"halvings":0,"cell_chars":16384,"cell_head_chars":4096},"cells_cut":0,"cells_raw":0,"read":"whole","date_system":"1900"}

{"sheet":"Setup","index":0,"n_rows":34,"n_cols":14,"rows_kept":34,"cut":false,"hidden":false,"merged":[[1,3,2,3],[4,3,7,3]]}
["ΤΟΥΡΝΟΥΑ 32άρι ταμπλό",null,null,"Θέσεις","seed",null,null,0,"seed","space pos","Index","Value"]
[null,null,null,"3-4",{"$f":"VALUE(LEFT(F2,1))","v":3},"3 4",null,{"$f":"IF(I2=\"-\",\"-\",IF(I2>0,H1+1,0))","v":1},{"$f":"IF(J2>0,VALUE(MID($A$32,1,J2-1)),\"-\")","v":1},{"$f":"IF(LEN($A$32)>1,FIND(\" \",$A$32,1),0)","v":2},1,1]
["Διοργανωτής: ","Η' ΕΝΩΣΗ",null,null,{"$f":"VALUE(RIGHT(F2,1))","v":4},null,null,2,{"$f":"IF(J3>0,VALUE(MID($A$32,J2+1,J3-J2-1)),\"-\")","v":2},{"$f":"IF(AND(J2>0,LEN($A$32)>J2+1),FIND(\" \",$A$32,J2+1),0)","v":4},2,2]
["Τίτλος Τουρνουά: ","3ο Ενωσιακό",null,"Θέσεις","seed",null,null,3,3,6,3,3]
["Συντομογραφία: ","Ε3",null,"5-8",{"$f":"TRIM(LEFT(F5,(FIND(\" \",F5,1)-1)))","v":"8"},"8 5 6 7",null,4,4,8,4,4]
["Έδρα αγώνων: ","Αττικός Ήλιος",null,null,{"$f":"TRIM(MID(F5,(FIND(\" \",F5,1)),FIND(\" \",F5,(FIND(\" \",F5,1)+1))-(FIND(\" \",F5,1))))","v":"5"},null,null,5,5,10,5,5]
["Κατηγορίες: ","Α14",null,null,{"$f":"TRIM(MID(F5, (FIND(\" \",F5,(FIND(\" \",F5,1)+1))+1), (FIND(\" \",F5,(FIND(\" \",F5,(FIND(\" \",F5,1)+1))+1)))-(FIND(\" \",F5,(FIND(\" \",F5,1)+1))+1)))","v":"6"},null,null,6,6,12,6,6]
["Έναρξη: ","4",null,null,{"$f":"TRIM(RIGHT(F5,LEN(F5)-(FIND(\" \",F5,(FIND(\" \",F5,(FIND(\" \",F5,1)+1))+1)))))","v":"7"},null,null,7,7,14,7,7]
["Λήξη: ","6 Μαι 2012",null,null,null,null,null,8,8,16,8,8]
["Επιδιατητής: ","Ντ.Πατσουράκου",null,null,null,null,null,9,29,19,9,29]
["Τηλέφωνο επιδ: ","6934 306004",null,null,null,null,null,10,{"$f":"IF(J11>0,VALUE(MID($A$32,J10+1,J11-J10-1)),\"-\")","v":17},22,10,17]
[null,null,null,null,null,null,null,{"$f":"IF(I12=\"-\",\"-\",IF(I12>0,H11+1,0))","v":11},30,25,11,30]
[null,null,null,null,null,null,null,12,10,28,12,10]
[null,null,null,null,null,null,null,13,11,31,13,11]
[null,null,null,null,null,null,null,14,18,34,14,18]
{"$rows_left_out":20}
{"sheet":"DrawPrep","index":1,"n_rows":43,"n_cols":10,"rows_kept":43,"cut":false,"hidden":false,"merged":[[0,7,0,8],[36,1,36,3]]}
[null,{"$f":"Setup!B3 & \", \" & Setup!B4 & \", \" & Setup!B6 & \", \" & Setup!B8 & \"-\" & Setup!B9 & \" (\" & Setup!B7 & \")\"","v":"Η' ΕΝΩΣΗ, 3ο Ενωσιακό, Αττικός Ήλιος, 4-6 Μαι 2012 (Α14)"},null,null,null,null,null,{"$f":"Setup!B10","v":"Ντ.Πατσουράκου"}]
["α/α","από","Α.Μ.","Ονοματεπώνυμο","points","Έτος","Σύλλογος","Τηλέφωνο","Υπογραφή αθλητή","SortPts"]
[1,null,25438,"ΤΣΙΤΣΙΠΑΣ ΣΤΕΦΑΝΟΣ",190,1998,"Ο.Α.ΓΛΥΦΑΔΑΣ",null,null,{"$f":"IF(D3>\" \",IF(E3>=0,E3+tmp!G6,tmp!G6),0)","v":190.02321776955924}]
[2,null,23775,"ΑΝΤΩΝΟΠΟΥΛΟΣ ΧΡΗΣΤΟΣ",180,1998,"Ο.Α.ΚΕΡΑΤΣΙΝΙΟΥ",null,null,{"$f":"IF(D4>\" \",IF(E4>=0,E4+tmp!G30,tmp!G30),0)","v":180.01149720017813}]
[3,null,25875,"ΛΑΖΑΡΙΔΗΣ ΚΩΝΣΤΑΝΤΙΝΟΣ",160,1998,"Ε.Σ.Ο.ΕΠΙΚΟΥΡΟΣ ΠΟΛΙΧΝΗΣ",null,null,{"$f":"IF(D5>\" \",IF(E5>=0,E5+tmp!G28,tmp!G28),0)","v":160.0232090901757}]
[4,null,23517,"ΤΣΙΡΑΝΙΔΗΣ ΕΥΣΤΑΘΙΟΣ",140,1998,"Ο.Α.ΤΟΥΜΠΑΣ",null,null,{"$f":"IF(D6>\" \",IF(E6>=0,E6+tmp!G26,tmp!G26),0)","v":140.02271747010604}]
[5,null,24845,"ΗΛΙΟΠΟΥΛΟΣ ΒΑΣΙΛΗΣ",140,1998,"Α.Ο.Α.ΦΙΛΟΘΕΗΣ",null,null,{"$f":"IF(D7>\" \",IF(E7>=0,E7+tmp!G12,tmp!G12),0)","v":140.00597110584525}]
[6,null,25297,"ΚΑΠΙΡΗΣ ΣΤΑΜΑΤΗΣ",61,1999,"Α.Ο.Α.ΦΙΛΟΘΕΗΣ",null,null,{"$f":"IF(D8>\" \",IF(E8>=0,E8+tmp!G10,tmp!G10),0)","v":61.037856303967295}]
[7,null,22866,"ΚΟΝΤΟΠΟΥΛΟΣ ΘΕΟΦΑΝΗΣ",60,1998,"Ο.Α.ΚΟΡΙΝΘΟΥ",null,null,{"$f":"IF(D9>\" \",IF(E9>=0,E9+tmp!G9,tmp!G9),0)","v":60.01850287225674}]
[8,null,26190,"ΑΝΔΡΩΝΗΣ ΙΩΑΝΝΗΣ",60,1999,"Ο.Α.ΑΓΙΑΣ ΠΑΡΑΣΚΕΥΗΣ",null,null,{"$f":"IF(D10>\" \",IF(E10>=0,E10+tmp!G23,tmp!G23),0)","v":60.006539691076917}]
[9,null,25296,"ΣΠΑΘΗΣ ΜΑΡΙΝΟΣ",60,1998,"Α.Ο.Α.ΗΛΙΟΥΠΟΛΗΣ",null,null,{"$f":"IF(D11>\" \",IF(E11>=0,E11+tmp!G18,tmp!G18),0)","v":60.000036398581607}]
[10,null,24516,"ΒΟΪΝΕΑ ΑΛΕΞΑΝΔΡΟΣ",58,1998,"Ο.Α.ΒΟΥΛΙΑΓΜΕΝΗΣ ΜΙΚΡΟΙ ΑΣΣΟΙ",null,null,{"$f":"IF(D12>\" \",IF(E12>=0,E12+tmp!G33,tmp!G33),0)","v":58.036982844399034}]
[11,null,26317,"ΚΩΣΤΑΡΑΣ ΠΑΝΑΓΙΩΤΗΣ",58,1999,"Ο.Α.ΠΕΤΡΟΥΠΟΛΗΣ",null,null,{"$f":"IF(D13>\" \",IF(E13>=0,E13+tmp!G25,tmp!G25),0)","v":58.004504163712149}]
[12,null,26297,"ΑΓΙΟΥΣ ΓΕΩΡΓΙΟΣ",56,1999,"ΚΕΡΚΥΡΑΪΚΗ Λ.Τ.",null,null,{"$f":"IF(D14>\" \",IF(E14>=0,E14+tmp!G5,tmp!G5),0)","v":56.038712929443335}]
[13,null,23040,"ΚΑΤΣΑΛΗΣ ΚΩΝΣΤΑΝΤΙΝΟΣ",55,1998,"Α.Σ.Α.ΛΑΡΙΣΑΣ",null,null,{"$f":"IF(D15>\" \",IF(E15>=0,E15+tmp!G24,tmp!G24),0)","v":55.008751234266654}]
{"$rows_left_out":29}
{"sheet":"Draw32","index":2,"n_rows":48,"n_cols":20,"rows_kept":48,"cut":false,"hidden":false,"merged":[[42,17,42,19],[0,0,0,17],[2,9,2,11]]}
[{"$f":"Setup!B3 & \", \" & Setup!B4 & \", \" & Setup!B6 & \", \" & Setup!B8 & \"-\" & Setup!B9","v":"Η' ΕΝΩΣΗ, 3ο Ενωσιακό, Αττικός Ήλιος, 4-6 Μαι 2012"},null,null,null,null,null,null,null,null,null,null,null,null,null,null,null,null,null,null,{"$f":"Setup!B7","v":"Α14"}]
[null,{"$f":"Setup!B18","v":0}]
[null,null,null,null,null,null,null,null,null,32,null,null,null,16,null,8,null,4,null,"2 & w"]
["α/α",null,"ByeOrder","ByeSum","ByeCnt","από","seed","Pts","Α.Μ.","Ονοματεπώνυμο","επώνυμο","Σύλλογος"]
[1,1,null,null,0,{"$f":"IF(NOT($G5=\"-\"),VLOOKUP($G5,DrawPrep!$A$3:$G$34,2,FALSE),\"\")","v":0},{"$f":"VLOOKUP($B5,Setup!$K$2:$L$33,2,FALSE)","v":1},{"$f":"IF($G5>0,VLOOKUP($G5,DrawPrep!$A$3:$G$34,5,FALSE),0)","v":190},{"$f":"IF($G5>0,VLOOKUP($G5,DrawPrep!$A$3:$G$34,3,FALSE),0)","v":25438},{"$f":"IF($I5>0,VLOOKUP($I5,DrawPrep!$C$3:$G$34,2,FALSE),\"bye\")","v":"ΤΣΙΤΣΙΠΑΣ ΣΤΕΦΑΝΟΣ"},{"$f":"IF($I5>0,LEFT(J5,FIND(\" \",J5)-1),\"\")","v":"ΤΣΙΤΣΙΠΑΣ"},{"$f":"IF($I5>0,VLOOKUP($I5,DrawPrep!$C$3:$G$34,5,FALSE),\"\")","v":"Ο.Α.ΓΛΥΦΑΔΑΣ"},1,{"$f":"UPPER(IF($A$2=\"R\",IF(OR(M5=1,M5=\"a\"),I5,IF(OR(M5=2,M5=\"b\"),I6,\"\")),IF(OR(M5=1,M5=\"1\"),K5,IF(OR(M5=2,M5=\"b\"),K6,\"\"))))","v":"ΤΣΙΤΣΙΠΑΣ"}]
[2,{"$f":"1-D6+8","v":9},{"$f":"B5","v":1},{"$f":"E6","v":0},{"$f":"IF($B$2>=C6,1,0)","v":0},{"$f":"IF(NOT($G6=\"-\"),VLOOKUP($G6,DrawPrep!$A$3:$G$34,2,FALSE),\"\")","v":0},{"$f":"IF($B$2>=C6,\"-\",VLOOKUP($B6,Setup!$K$2:$L$33,2,FALSE))","v":29},{"$f":"IF(NOT($G6=\"-\"),VLOOKUP($G6,DrawPrep!$A$3:$G$34,5,FALSE),0)","v":31.8},{"$f":"IF(NOT($G6=\"-\"),VLOOKUP($G6,DrawPrep!$A$3:$G$34,3,FALSE),0)","v":27398},{"$f":"IF($I6>0,VLOOKUP($I6,DrawPrep!$C$3:$G$34,2,FALSE),\"bye\")","v":"ΚΟΤΣΑΡΙΝΗΣ ΒΑΣΙΛΕΙΟΣ"},{"$f":"IF($I6>0,LEFT(J6,FIND(\" \",J6)-1),\"\")","v":"ΚΟΤΣΑΡΙΝΗΣ"},{"$f":"IF($I6>0,VLOOKUP($I6,DrawPrep!$C$3:$G$34,5,FALSE),\"\")","v":"Α.Γ.Ο.ΦΙΛΙΠΠΙΑΔΑΣ"},null,null,1,{"$f":"UPPER(IF($A$2=\"R\",IF(OR(O6=1,O6=\"a\"),N5,IF(OR(O6=2,O6=\"b\"),N7,\"\")),IF(OR(O6=1,O6=\"a\"),N5,IF(OR(O6=2,O6=\"b\"),N7,\"\"))))","v":"ΤΣΙΤΣΙΠΑΣ"}]
[3,{"$f":"2-D7+8","v":10},null,{"$f":"D6+E7","v":0},0,{"$f":"IF(NOT($G7=\"-\"),VLOOKUP($G7,DrawPrep!$A$3:$G$34,2,FALSE),\"\")","v":0},{"$f":"VLOOKUP($B7,Setup!$K$2:$L$33,2,FALSE)","v":17},{"$f":"IF($G7>0,VLOOKUP($G7,DrawPrep!$A$3:$G$34,5,FALSE),0)","v":46},{"$f":"IF($G7>0,VLOOKUP($G7,DrawPrep!$A$3:$G$34,3,FALSE),0)","v":26478},{"$f":"IF($I7>0,VLOOKUP($I7,DrawPrep!$C$3:$G$34,2,FALSE),\"bye\")","v":"ΚΗΠΟΥΡΟΣ ΣΤΑΥΡΟΣ"},{"$f":"IF($I7>0,LEFT(J7,FIND(\" \",J7)-1),\"\")","v":"ΚΗΠΟΥΡΟΣ"},{"$f":"IF($I7>0,VLOOKUP($I7,DrawPrep!$C$3:$G$34,5,FALSE),\"\")","v":"Ο.Α.ΧΑΝΙΩΝ"},2,{"$f":"UPPER(IF($A$2=\"R\",IF(OR(M7=1,M7=\"a\"),I7,IF(OR(M7=2,M7=\"b\"),I8,\"\")),IF(OR(M7=1,M7=\"a\"),K7,IF(OR(M7=2,M7=\"b\"),K8,\"\"))))","v":"ΒΛΑΧΟΝΙΚΟΛΟΣ"}]
[4,{"$f":"3-D8+8","v":11},15,{"$f":"D7+E8","v":0},{"$f":"IF($B$2>=C8,1,0)","v":0},{"$f":"IF(NOT($G8=\"-\"),VLOOKUP($G8,DrawPrep!$A$3:$G$34,2,FALSE),\"\")","v":0},{"$f":"IF($B$2>=C8,\"-\",VLOOKUP($B8,Setup!$K$2:$L$33,2,FALSE))","v":30},{"$f":"IF(NOT($G8=\"-\"),VLOOKUP($G8,DrawPrep!$A$3:$G$34,5,FALSE),0)","v":31},{"$f":"IF(NOT($G8=\"-\"),VLOOKUP($G8,DrawPrep!$A$3:$G$34,3,FALSE),0)","v":27874},{"$f":"IF($I8>0,VLOOKUP($I8,DrawPrep!$C$3:$G$34,2,FALSE),\"bye\")","v":"ΒΛΑΧΟΝΙΚΟΛΟΣ ΠΑΝΑΓΙΩΤΗΣ"},"ΒΛΑΧΟΝΙΚΟΛΟΣ",{"$f":"IF($I8>0,VLOOKUP($I8,DrawPrep!$C$3:$G$34,5,FALSE),\"\")","v":"ΡΟΔΙΑΚΟΣ Ο.Α."},null,null,null,null,1,{"$f":"UPPER(IF($A$2=\"R\",IF(OR(Q8=1,Q8=\"a\"),P6,IF(OR(Q8=2,Q8=\"b\"),P10,\"\")),IF(OR(Q8=1,Q8=\"a\"),P6,IF(OR(Q8=2,Q8=\"b\"),P10,\"\"))))","v":"ΤΣΙΤΣΙΠΑΣ"}]
[5,{"$f":"4-D9+8","v":12},null,0,0,{"$f":"IF(NOT($G9=\"-\"),VLOOKUP($G9,DrawPrep!$A$3:$G$34,2,FALSE),\"\")","v":0},{"$f":"VLOOKUP($B9,Setup!$K$2:$L$33,2,FALSE)","v":10},{"$f":"IF($G9>0,VLOOKUP($G9,DrawPrep!$A$3:$G$34,5,FALSE),0)","v":58},{"$f":"IF($G9>0,VLOOKUP($G9,DrawPrep!$A$3:$G$34,3,FALSE),0)","v":24516},{"$f":"IF($I9>0,VLOOKUP($I9,DrawPrep!$C$3:$G$34,2,FALSE),\"bye\")","v":"ΒΟΪΝΕΑ ΑΛΕΞΑΝΔΡΟΣ"},"ΒΟΪΝΕΑ",{"$f":"IF($I9>0,VLOOKUP($I9,DrawPrep!$C$3:$G$34,5,FALSE),\"\")","v":"Ο.Α.ΒΟΥΛΙΑΓΜΕΝΗΣ ΜΙΚΡΟΙ ΑΣΣΟΙ"},1,{"$f":"UPPER(IF($A$2=\"R\",IF(OR(M9=1,M9=\"a\"),I9,IF(OR(M9=2,M9=\"b\"),I10,\"\")),IF(OR(M9=1,M9=\"a\"),K9,IF(OR(M9=2,M9=\"b\"),K10,\"\"))))","v":"ΒΟΪΝΕΑ"}]
[6,{"$f":"5-D10+8","v":13},9,0,{"$f":"IF($B$2>=C10,1,0)","v":0},{"$f":"IF(NOT($G10=\"-\"),VLOOKUP($G10,DrawPrep!$A$3:$G$34,2,FALSE),\"\")","v":0},{"$f":"IF($B$2>=C10,\"-\",VLOOKUP($B10,Setup!$K$2:$L$33,2,FALSE))","v":11},{"$f":"IF(NOT($G10=\"-\"),VLOOKUP($G10,DrawPrep!$A$3:$G$34,5,FALSE),0)","v":58},{"$f":"IF(NOT($G10=\"-\"),VLOOKUP($G10,DrawPrep!$A$3:$G$34,3,FALSE),0)","v":26317},{"$f":"IF($I10>0,VLOOKUP($I10,DrawPrep!$C$3:$G$34,2,FALSE),\"bye\")","v":"ΚΩΣΤΑΡΑΣ ΠΑΝΑΓΙΩΤΗΣ"},"ΚΩΣΤΑΡΑΣ",{"$f":"IF($I10>0,VLOOKUP($I10,DrawPrep!$C$3:$G$34,5,FALSE),\"\")","v":"Ο.Α.ΠΕΤΡΟΥΠΟΛΗΣ"},null,null,2,{"$f":"UPPER(IF($A$2=\"R\",IF(OR(O10=1,O10=\"a\"),N9,IF(OR(O10=2,O10=\"b\"),N11,\"\")),IF(OR(O10=1,O10=\"a\"),N9,IF(OR(O10=2,O10=\"b\"),N11,\"\"))))","v":"ΑΝΔΡΩΝΗΣ"}]
[7,{"$f":"6-D11+8","v":14},{"$f":"B12","v":8},0,{"$f":"IF($B$2>=C11,1,0)","v":0},{"$f":"IF(NOT($G11=\"-\"),VLOOKUP($G11,DrawPrep!$A$3:$G$34,2,FALSE),\"\")","v":0},{"$f":"IF($B$2>=C11,\"-\",VLOOKUP($B11,Setup!$K$2:$L$33,2,FALSE))","v":18},{"$f":"IF(NOT($G11=\"-\"),VLOOKUP($G11,DrawPrep!$A$3:$G$34,5,FALSE),0)","v":46},{"$f":"IF(NOT($G11=\"-\"),VLOOKUP($G11,DrawPrep!$A$3:$G$34,3,FALSE),0)","v":26389},{"$f":"IF($I11>0,VLOOKUP($I11,DrawPrep!$C$3:$G$34,2,FALSE),\"bye\")","v":"ΒΑΡΔΑΚΗΣ ΒΑΣΙΛΕΙΟΣ"},"ΒΑΡΔΑΚΗΣ",{"$f":"IF($I11>0,VLOOKUP($I11,DrawPrep!$C$3:$G$34,5,FALSE),\"\")","v":"ΑΚΑΔ.ΑΝΤΙΣΦ.ΙΩΑΝΝΙΝΩΝ"},2,{"$f":"UPPER(IF($A$2=\"R\",IF(OR(M11=1,M11=\"a\"),I11,IF(OR(M11=2,M11=\"b\"),I12,\"\")),IF(OR(M11=1,M11=\"a\"),K11,IF(OR(M11=2,M11=\"b\"),K12,\"\"))))","v":"ΑΝΔΡΩΝΗΣ"}]
[8,{"$f":"VALUE(Setup!E5)","v":8},null,0,0,{"$f":"IF(NOT($G12=\"-\"),VLOOKUP($G12,DrawPrep!$A$3:$G$34,2,FALSE),\"\")","v":0},{"$f":"VLOOKUP($B12,Setup!$K$2:$L$33,2,FALSE)","v":8},{"$f":"IF($G12>0,VLOOKUP($G12,DrawPrep!$A$3:$G$34,5,FALSE),0)","v":60},{"$f":"IF($G12>0,VLOOKUP($G12,DrawPrep!$A$3:$G$34,3,FALSE),0)","v":26190},{"$f":"IF($I12>0,VLOOKUP($I12,DrawPrep!$C$3:$G$34,2,FALSE),\"bye\")","v":"ΑΝΔΡΩΝΗΣ ΙΩΑΝΝΗΣ"},"ΑΝΔΡΩΝΗΣ",{"$f":"IF($I12>0,VLOOKUP($I12,DrawPrep!$C$3:$G$34,5,FALSE),\"\")","v":"Ο.Α.ΑΓΙΑΣ ΠΑΡΑΣΚΕΥΗΣ"},null,null,null,null,null,null,1,{"$f":"UPPER(IF($A$2=\"R\",IF(OR(S12=1,S12=\"a\"),R8,IF(OR(S12=2,S12=\"b\"),R16,\"\")),IF(OR(S12=1,S12=\"a\"),R8,IF(OR(S12=2,S12=\"b\"),R16,\"\"))))","v":"ΤΣΙΤΣΙΠΑΣ"}]
[9,{"$f":"VALUE(Setup!E2)","v":3},null,0,0,{"$f":"IF(NOT($G13=\"-\"),VLOOKUP($G13,DrawPrep!$A$3:$G$34,2,FALSE),\"\")","v":0},{"$f":"VLOOKUP($B13,Setup!$K$2:$L$33,2,FALSE)","v":3},{"$f":"IF($G13>0,VLOOKUP($G13,DrawPrep!$A$3:$G$34,5,FALSE),0)","v":160},{"$f":"IF($G13>0,VLOOKUP($G13,DrawPrep!$A$3:$G$34,3,FALSE),0)","v":25875},{"$f":"IF($I13>0,VLOOKUP($I13,DrawPrep!$C$3:$G$34,2,FALSE),\"bye\")","v":"ΛΑΖΑΡΙΔΗΣ ΚΩΝΣΤΑΝΤΙΝΟΣ"},"ΛΑΖΑΡΙΔΗΣ",{"$f":"IF($I13>0,VLOOKUP($I13,DrawPrep!$C$3:$G$34,5,FALSE),\"\")","v":"Ε.Σ.Ο.ΕΠΙΚΟΥΡΟΣ ΠΟΛΙΧΝΗΣ"},1,{"$f":"UPPER(IF($A$2=\"R\",IF(OR(M13=1,M13=\"a\"),I13,IF(OR(M13=2,M13=\"b\"),I14,\"\")),IF(OR(M13=1,M13=\"a\"),K13,IF(OR(M13=2,M13=\"b\"),K14,\"\"))))","v":"ΛΑΖΑΡΙΔΗΣ"}]
[10,{"$f":"7-D14+8","v":15},{"$f":"B13","v":3},0,{"$f":"IF($B$2>=C14,1,0)","v":0},{"$f":"IF(NOT($G14=\"-\"),VLOOKUP($G14,DrawPrep!$A$3:$G$34,2,FALSE),\"\")","v":0},{"$f":"IF($B$2>=C14,\"-\",VLOOKUP($B14,Setup!$K$2:$L$33,2,FALSE))","v":24},{"$f":"IF(NOT($G14=\"-\"),VLOOKUP($G14,DrawPrep!$A$3:$G$34,5,FALSE),0)","v":41},{"$f":"IF(NOT($G14=\"-\"),VLOOKUP($G14,DrawPrep!$A$3:$G$34,3,FALSE),0)","v":28285},{"$f":"IF($I14>0,VLOOKUP($I14,DrawPrep!$C$3:$G$34,2,FALSE),\"bye\")","v":"ΠΗΛΙΟΥΝΗΣ ΜΙΧΑΗΛ"},"ΠΗΛΙΟΥΝΗΣ",{"$f":"IF($I14>0,VLOOKUP($I14,DrawPrep!$C$3:$G$34,5,FALSE),\"\")","v":"Ο.Α.ΒΟΥΛΙΑΓΜΕΝΗΣ ΜΙΚΡΟΙ ΑΣΣΟΙ"},null,null,1,{"$f":"UPPER(IF($A$2=\"R\",IF(OR(O14=1,O14=\"a\"),N13,IF(OR(O14=2,O14=\"b\"),N15,\"\")),IF(OR(O14=1,O14=\"a\"),N13,IF(OR(O14=2,O14=\"b\"),N15,\"\"))))","v":"ΛΑΖΑΡΙΔΗΣ"}]
[11,{"$f":"8-D15+8","v":16},null,0,0,{"$f":"IF(NOT($G15=\"-\"),VLOOKUP($G15,DrawPrep!$A$3:$G$34,2,FALSE),\"\")","v":0},{"$f":"VLOOKUP($B15,Setup!$K$2:$L$33,2,FALSE)","v":15},{"$f":"IF($G15>0,VLOOKUP($G15,DrawPrep!$A$3:$G$34,5,FALSE),0)","v":49},{"$f":"IF($G15>0,VLOOKUP($G15,DrawPrep!$A$3:$G$34,3,FALSE),0)","v":28396},{"$f":"IF($I15>0,VLOOKUP($I15,DrawPrep!$C$3:$G$34,2,FALSE),\"bye\")","v":"ΛΑΜΠΡΟΠΟΥΛΟΣ ΙΟΒΑΝ-ΑΛΕΞΑΝΤΕΡ"},"ΛΑΜΠΡΟΠΟΥΛΟΣ",{"$f":"IF($I15>0,VLOOKUP($I15,DrawPrep!$C$3:$G$34,5,FALSE),\"\")","v":"Ο.Α.ΒΟΥΛΙΑΓΜΕΝΗΣ ΜΙΚΡΟΙ ΑΣΣΟΙ"},2,{"$f":"UPPER(IF($A$2=\"R\",IF(OR(M15=1,M15=\"a\"),I15,IF(OR(M15=2,M15=\"b\"),I16,\"\")),IF(OR(M15=1,M15=\"a\"),K15,IF(OR(M15=2,M15=\"b\"),K16,\"\"))))","v":"ΚΑΤΣΑΛΗΣ"}]
{"$rows_left_out":34}
{"sheet":"PrgPrep","index":3,"n_rows":37,"n_cols":7,"rows_kept":37,"cut":false,"hidden":false,"merged":[]}
[{"$f":"Setup!B3 & \", \" & Setup!B4 & \", \" & Setup!B6  & \" (\" & Setup!B7 & \")\"","v":"Η' ΕΝΩΣΗ, 3ο Ενωσιακό, Αττικός Ήλιος (Α14)"},null,null,null,null,null,"Don't Change this Worksheet !"]
[{"$f":"CONCATENATE(Setup!B10,\", \",Setup!B11)","v":"Ντ.Πατσουράκου, 6934 306004"}]
["Πρόγραμμα αγώνων",null,null,null,{"$f":"Setup!B8","v":"4"}]
["ΩΡΑ","Κτγρ.","Αθλητής-Σύλλογος",null,"Αθλητής-Σύλλογος"]
["Έναρξη",{"$f":"Setup!$B$7","v":"Α14"},{"$f":"IF(OR(Draw32!J5=\"bye\",Draw32!J5=\"LWD\"),\"\",CONCATENATE(LEFT(Draw32!J5,FIND(\" \",Draw32!J5)+1),\" (\",Draw32!L5,\")\"))","v":"ΤΣΙΤΣΙΠΑΣ Σ (Ο.Α.ΓΛΥΦΑΔΑΣ)"},{"$f":"IF(OR(C5=\"\",E5=\"\"),\" \",\"-\")","v":"-"},{"$f":"IF(OR(Draw32!J6=\"bye\",Draw32!J6=\"LWD\"), \"\", CONCATENATE(LEFT(Draw32!J6,FIND(\" \",Draw32!J6)+1),\" (\",Draw32!L6,\")\"))","v":"ΚΟΤΣΑΡΙΝΗΣ Β (Α.Γ.Ο.ΦΙΛΙΠΠΙΑΔΑΣ)"}]
[null,{"$f":"Setup!$B$7","v":"Α14"},{"$f":"IF(OR(Draw32!J7=\"bye\",Draw32!J7=\"LWD\"),\"\",CONCATENATE(LEFT(Draw32!J7,FIND(\" \",Draw32!J7)+1),\" (\",Draw32!L7,\")\"))","v":"ΚΗΠΟΥΡΟΣ Σ (Ο.Α.ΧΑΝΙΩΝ)"},{"$f":"IF(OR(C6=\"\",E6=\"\"),\" \",\"-\")","v":"-"},{"$f":"IF(OR(Draw32!J8=\"bye\",Draw32!J8=\"LWD\"), \"\", CONCATENATE(LEFT(Draw32!J8,FIND(\" \",Draw32!J8)+1),\" (\",Draw32!L8,\")\"))","v":"ΒΛΑΧΟΝΙΚΟΛΟΣ Π (ΡΟΔΙΑΚΟΣ Ο.Α.)"}]
[null,{"$f":"Setup!$B$7","v":"Α14"},{"$f":"IF(OR(Draw32!J9=\"bye\",Draw32!J9=\"LWD\"),\"\",CONCATENATE(LEFT(Draw32!J9,FIND(\" \",Draw32!J9)+1),\" (\",Draw32!L9,\")\"))","v":"ΒΟΪΝΕΑ Α (Ο.Α.ΒΟΥΛΙΑΓΜΕΝΗΣ ΜΙΚΡΟΙ ΑΣΣΟΙ)"},"-",{"$f":"IF(OR(Draw32!J10=\"bye\",Draw32!J10=\"LWD\"), \"\", CONCATENATE(LEFT(Draw32!J10,FIND(\" \",Draw32!J10)+1),\" (\",Draw32!L10,\")\"))","v":"ΚΩΣΤΑΡΑΣ Π (Ο.Α.ΠΕΤΡΟΥΠΟΛΗΣ)"}]
[null,{"$f":"Setup!$B$7","v":"Α14"},{"$f":"IF(OR(Draw32!J11=\"bye\",Draw32!J11=\"LWD\"),\"\",CONCATENATE(LEFT(Draw32!J11,FIND(\" \",Draw32!J11)+1),\" (\",Draw32!L11,\")\"))","v":"ΒΑΡΔΑΚΗΣ Β (ΑΚΑΔ.ΑΝΤΙΣΦ.ΙΩΑΝΝΙΝΩΝ)"},"-",{"$f":"IF(OR(Draw32!J12=\"bye\",Draw32!J12=\"LWD\"), \"\", CONCATENATE(LEFT(Draw32!J12,FIND(\" \",Draw32!J12)+1),\" (\",Draw32!L12,\")\"))","v":"ΑΝΔΡΩΝΗΣ Ι (Ο.Α.ΑΓΙΑΣ ΠΑΡΑΣΚΕΥΗΣ)"}]
[null,{"$f":"Setup!$B$7","v":"Α14"},{"$f":"IF(OR(Draw32!J13=\"bye\",Draw32!J13=\"LWD\"),\"\",CONCATENATE(LEFT(Draw32!J13,FIND(\" \",Draw32!J13)+1),\" (\",Draw32!L13,\")\"))","v":"ΛΑΖΑΡΙΔΗΣ Κ (Ε.Σ.Ο.ΕΠΙΚΟΥΡΟΣ ΠΟΛΙΧΝΗΣ)"},"-",{"$f":"IF(OR(Draw32!J14=\"bye\",Draw32!J14=\"LWD\"), \"\", CONCATENATE(LEFT(Draw32!J14,FIND(\" \",Draw32!J14)+1),\" (\",Draw32!L14,\")\"))","v":"ΠΗΛΙΟΥΝΗΣ Μ (Ο.Α.ΒΟΥΛΙΑΓΜΕΝΗΣ ΜΙΚΡΟΙ ΑΣΣΟΙ)"}]
["όχι πριν",{"$f":"Setup!$B$7","v":"Α14"},{"$f":"IF(OR(Draw32!J15=\"bye\",Draw32!J15=\"LWD\"),\"\",CONCATENATE(LEFT(Draw32!J15,FIND(\" \",Draw32!J15)+1),\" (\",Draw32!L15,\")\"))","v":"ΛΑΜΠΡΟΠΟΥΛΟΣ Ι (Ο.Α.ΒΟΥΛΙΑΓΜΕΝΗΣ ΜΙΚΡΟΙ ΑΣΣΟΙ)"},"-",{"$f":"IF(OR(Draw32!J16=\"bye\",Draw32!J16=\"LWD\"), \"\", CONCATENATE(LEFT(Draw32!J16,FIND(\" \",Draw32!J16)+1),\" (\",Draw32!L16,\")\"))","v":"ΚΑΤΣΑΛΗΣ Κ (Α.Σ.Α.ΛΑΡΙΣΑΣ)"}]
[null,{"$f":"Setup!$B$7","v":"Α14"},{"$f":"IF(OR(Draw32!J17=\"bye\",Draw32!J17=\"LWD\"),\"\",CONCATENATE(LEFT(Draw32!J17,FIND(\" \",Draw32!J17)+1),\" (\",Draw32!L17,\")\"))","v":"ΑΓΙΟΥΣ Γ (ΚΕΡΚΥΡΑΪΚΗ Λ.Τ.)"},"-",{"$f":"IF(OR(Draw32!J18=\"bye\",Draw32!J18=\"LWD\"), \"\", CONCATENATE(LEFT(Draw32!J18,FIND(\" \",Draw32!J18)+1),\" (\",Draw32!L18,\")\"))","v":"ΙΩΑΝΝΙΔΗΣ Ν (Α.Ο.Α.ΦΙΛΟΘΕΗΣ)"}]
[null,{"$f":"Setup!$B$7","v":"Α14"},{"$f":"IF(OR(Draw32!J19=\"bye\",Draw32!J19=\"LWD\"),\"\",CONCATENATE(LEFT(Draw32!J19,FIND(\" \",Draw32!J19)+1),\" (\",Draw32!L19,\")\"))","v":"ΚΙΣΣΑΣ Χ (Α.Ο.ΣΙΚΥΩΝΟΣ ΚΙΑΤΟΥ)"},"-",{"$f":"IF(OR(Draw32!J20=\"bye\",Draw32!J20=\"LWD\"), \"\", CONCATENATE(LEFT(Draw32!J20,FIND(\" \",Draw32!J20)+1),\" (\",Draw32!L20,\")\"))","v":"ΗΛΙΟΠΟΥΛΟΣ Β (Α.Ο.Α.ΦΙΛΟΘΕΗΣ)"}]
[null,{"$f":"Setup!$B$7","v":"Α14"},{"$f":"IF(OR(Draw32!J21=\"bye\",Draw32!J21=\"LWD\"),\"\",CONCATENATE(LEFT(Draw32!J21,FIND(\" \",Draw32!J21)+1),\" (\",Draw32!L21,\")\"))","v":"ΚΑΠΙΡΗΣ Σ (Α.Ο.Α.ΦΙΛΟΘΕΗΣ)"},"-",{"$f":"IF(OR(Draw32!J22=\"bye\",Draw32!J22=\"LWD\"), \"\", CONCATENATE(LEFT(Draw32!J22,FIND(\" \",Draw32!J22)+1),\" (\",Draw32!L22,\")\"))","v":"ΣΤΑΥΡΑΚΑΣ Μ (Α.Ο.Α.ΦΙΛΟΘΕΗΣ)"}]
[null,{"$f":"Setup!$B$7","v":"Α14"},{"$f":"IF(OR(Draw32!J23=\"bye\",Draw32!J23=\"LWD\"),\"\",CONCATENATE(LEFT(Draw32!J23,FIND(\" \",Draw32!J23)+1),\" (\",Draw32!L23,\")\"))","v":"ΚΑΛΑΜΠΑΚΑΣ Α (Α.Σ.Α.ΛΑΡΙΣΑΣ)"},"-",{"$f":"IF(OR(Draw32!J24=\"bye\",Draw32!J24=\"LWD\"), \"\", CONCATENATE(LEFT(Draw32!J24,FIND(\" \",Draw32!J24)+1),\" (\",Draw32!L24,\")\"))","v":"ΣΑΚΕΛΛΑΡΙΔΗΣ Μ (Ο.Α.ΑΓΙΑΣ ΠΑΡΑΣΚΕΥΗΣ)"}]
["όχι πριν",{"$f":"Setup!$B$7","v":"Α14"},{"$f":"IF(OR(Draw32!J25=\"bye\",Draw32!J25=\"LWD\"),\"\",CONCATENATE(LEFT(Draw32!J25,FIND(\" \",Draw32!J25)+1),\" (\",Draw32!L25,\")\"))","v":"ΠΑΧΑΚΗΣ Ν (Α.Ο.Α.ΗΛΙΟΥΠΟΛΗΣ)"},"-",{"$f":"IF(OR(Draw32!J26=\"bye\",Draw32!J26=\"LWD\"), \"\", CONCATENATE(LEFT(Draw32!J26,FIND(\" \",Draw32!J26)+1),\" (\",Draw32!L26,\")\"))","v":"ΓΕΡΟΥΚΗΣ Β (Ο.Α.ΝΙΚΑΙΑ ΛΑΡΙΣΑΣ)"}]
{"$rows_left_out":23}
{"sheet":"Day1","index":4,"n_rows":20,"n_cols":5,"rows_kept":20,"cut":false,"hidden":false,"merged":[]}
["Η' ΕΝΩΣΗ, 3ο Ενωσιακό, Αττικός Ήλιος (Α14)"]
["Ντ.Πατσουράκου, 6934 306004"]
["Πρόγραμμα αγώνων",null,null,null,"4"]
["ΩΡΑ","Κτγρ.","Αθλητής-Σύλλογος",null,"Αθλητής-Σύλλογος"]
["Έναρξη","Α14","ΤΣΙΤΣΙΠΑΣ Σ (Ο.Α.ΓΛΥΦΑΔΑΣ)","-","ΚΟΤΣΑΡΙΝΗΣ Β (Α.Γ.Ο.ΦΙΛΙΠΠΙΑΔΑΣ)"]
[null,"Α14","ΚΗΠΟΥΡΟΣ Σ (Ο.Α.ΧΑΝΙΩΝ)","-","ΒΛΑΧΟΝΙΚΟΛΟΣ Π (ΡΟΔΙΑΚΟΣ Ο.Α.)"]
[null,"Α14","ΒΟΪΝΕΑ Α (Ο.Α.ΒΟΥΛΙΑΓΜΕΝΗΣ ΜΙΚΡΟΙ ΑΣΣΟΙ)","-","ΚΩΣΤΑΡΑΣ Π (Ο.Α.ΠΕΤΡΟΥΠΟΛΗΣ)"]
[null,"Α14","ΒΑΡΔΑΚΗΣ Β (ΑΚΑΔ.ΑΝΤΙΣΦ.ΙΩΑΝΝΙΝΩΝ)","-","ΑΝΔΡΩΝΗΣ Ι (Ο.Α.ΑΓΙΑΣ ΠΑΡΑΣΚΕΥΗΣ)"]
[null,"Α14","ΛΑΖΑΡΙΔΗΣ Κ (Ε.Σ.Ο.ΕΠΙΚΟΥΡΟΣ ΠΟΛΙΧΝΗΣ)","-","ΠΗΛΙΟΥΝΗΣ Μ (Ο.Α.ΒΟΥΛΙΑΓΜΕΝΗΣ ΜΙΚΡΟΙ ΑΣΣΟΙ)"]
["όχι πριν","Α14","ΛΑΜΠΡΟΠΟΥΛΟΣ Ι (Ο.Α.ΒΟΥΛΙΑΓΜΕΝΗΣ ΜΙΚΡΟΙ ΑΣΣΟΙ)","-","ΚΑΤΣΑΛΗΣ Κ (Α.Σ.Α.ΛΑΡΙΣΑΣ)"]
[null,"Α14","ΑΓΙΟΥΣ Γ (ΚΕΡΚΥΡΑΪΚΗ Λ.Τ.)","-","ΙΩΑΝΝΙΔΗΣ Ν (Α.Ο.Α.ΦΙΛΟΘΕΗΣ)"]
[null,"Α14","ΚΙΣΣΑΣ Χ (Α.Ο.ΣΙΚΥΩΝΟΣ ΚΙΑΤΟΥ)","-","ΗΛΙΟΠΟΥΛΟΣ Β (Α.Ο.Α.ΦΙΛΟΘΕΗΣ)"]
[null,"Α14","ΚΑΠΙΡΗΣ Σ (Α.Ο.Α.ΦΙΛΟΘΕΗΣ)","-","ΣΤΑΥΡΑΚΑΣ Μ (Α.Ο.Α.ΦΙΛΟΘΕΗΣ)"]
[null,"Α14","ΚΑΛΑΜΠΑΚΑΣ Α (Α.Σ.Α.ΛΑΡΙΣΑΣ)","-","ΣΑΚΕΛΛΑΡΙΔΗΣ Μ (Ο.Α.ΑΓΙΑΣ ΠΑΡΑΣΚΕΥΗΣ)"]
["όχι πριν","Α14","ΠΑΧΑΚΗΣ Ν (Α.Ο.Α.ΗΛΙΟΥΠΟΛΗΣ)","-","ΓΕΡΟΥΚΗΣ Β (Ο.Α.ΝΙΚΑΙΑ ΛΑΡΙΣΑΣ)"]
{"$rows_left_out":6}
{"sheet":"Day2","index":5,"n_rows":20,"n_cols":5,"rows_kept":20,"cut":false,"hidden":false,"merged":[]}
["Η' ΕΝΩΣΗ, 3ο Ενωσιακό, Αττικός Ήλιος (Α14)"]
["Ντ.Πατσουράκου, 6934 306004"]
["Πρόγραμμα αγώνων",null,null,null,"Round 2"]
["ΩΡΑ","Κτγρ.","Αθλητής-Σύλλογος",null,"Αθλητής-Σύλλογος"]
["Έναρξη","Α14","ΤΣΙΤΣΙΠΑΣ Σ (Ο.Α.ΓΛΥΦΑΔΑΣ)","-","ΒΛΑΧΟΝΙΚΟΛΟΣ Π (ΡΟΔΙΑΚΟΣ Ο.Α.)"]
[null,"Α14","ΒΟΪΝΕΑ Α (Ο.Α.ΒΟΥΛΙΑΓΜΕΝΗΣ ΜΙΚΡΟΙ ΑΣΣΟΙ)","-","ΑΝΔΡΩΝΗΣ Ι (Ο.Α.ΑΓΙΑΣ ΠΑΡΑΣΚΕΥΗΣ)"]
[null,"Α14","ΛΑΖΑΡΙΔΗΣ Κ (Ε.Σ.Ο.ΕΠΙΚΟΥΡΟΣ ΠΟΛΙΧΝΗΣ)","-","ΚΑΤΣΑΛΗΣ Κ (Α.Σ.Α.ΛΑΡΙΣΑΣ)"]
[null,"Α14","ΑΓΙΟΥΣ Γ (ΚΕΡΚΥΡΑΪΚΗ Λ.Τ.)","-","ΗΛΙΟΠΟΥΛΟΣ Β (Α.Ο.Α.ΦΙΛΟΘΕΗΣ)"]
[null,"Α14","ΣΤΑΥΡΑΚΑΣ Μ (Α.Ο.Α.ΦΙΛΟΘΕΗΣ)","-","ΣΑΚΕΛΛΑΡΙΔΗΣ Μ (Ο.Α.ΑΓΙΑΣ ΠΑΡΑΣΚΕΥΗΣ)"]
["όχι πριν","Α14","ΠΑΧΑΚΗΣ Ν (Α.Ο.Α.ΗΛΙΟΥΠΟΛΗΣ)","-","ΤΣΙΡΑΝΙΔΗΣ Ε (Ο.Α.ΤΟΥΜΠΑΣ)"]
[null,"Α14","ΚΟΝΤΟΠΟΥΛΟΣ Θ (Ο.Α.ΚΟΡΙΝΘΟΥ)","-","ΣΗΜΑΙΟΦΟΡΙΔΗΣ Χ (ΠΕΥΚΗ-Γ.ΚΑΛΟΒΕΛΩΝΗΣ)"]
[null,"Α14","ΝΤΑΝΤΙΝΗΣ Α (Α.Ε.Τ.ΝΙΚΗ ΠΑΤΡΩΝ)","-","ΑΝΤΩΝΟΠΟΥΛΟΣ Χ (Ο.Α.ΚΕΡΑΤΣΙΝΙΟΥ)"]
[]
[]
[]
{"$rows_left_out":6}
{"sheet":"MyProgram","index":6,"n_rows":20,"n_cols":5,"rows_kept":20,"cut":false,"hidden":false,"merged":[]}
["Η' ΕΝΩΣΗ, 3ο Ενωσιακό, Αττικός Ήλιος (Α14)"]
["Ντ.Πατσουράκου, 6934 306004"]
["Πρόγραμμα αγώνων",null,null,null,"Round 3"]
["ΩΡΑ","Κτγρ.","Αθλητής-Σύλλογος",null,"Αθλητής-Σύλλογος"]
["Έναρξη"]
[]
[]
[]
[]
["όχι πριν"]
[]
[]
[]
[]
["όχι πριν"]
{"$rows_left_out":6}
{"sheet":"DrawPoints","index":7,"n_rows":4,"n_cols":6,"rows_kept":4,"cut":false,"hidden":false,"merged":[]}
[]
["17-32","9-16","5-8","3-4","2","1"]
[1,3,7,10,15,20]
[1,2,4,3,5,5]

{"sheet":"tmp","index":8,"n_rows":33,"n_cols":7,"rows_kept":33,"cut":false,"hidden":false,"merged":[]}
["α/α","seed","ByeOrder",null,"RndIndx","random","FixRandom"]
[1,1,null,null,1,{"$f":"RAND()/22","v":5.8600797434873149E-3},1.6215289147913745E-2]
[2,null,1,null,2,{"$f":"RAND()/22","v":9.729849622957561E-3},2.9054446509792765E-2]
[3,null,null,null,3,1.6914152386155137E-2,2.5913243203293732E-2]
[4,null,15,null,4,8.3883103681025931E-3,3.8712929443335202E-2]
[5,null,null,null,5,1.5689930097558428E-2,2.3217769559251821E-2]
[6,null,9,null,6,4.1411849887947556E-2,3.1148422079462966E-2]
[7,null,5,null,7,1.0125224960626763E-2,4.4894678391243163E-2]
[8,5,null,null,8,8.5217804393601486E-3,1.8502872256740265E-2]
[9,3,null,null,9,1.0196504872813024E-2,3.7856303967294801E-2]
[10,null,3,null,10,3.0327953948264232E-2,1.0351623053258813E-2]
[11,null,null,null,11,1.3978460702607075E-2,5.9711058452536622E-3]
[12,null,13,null,12,2.7121771111700624E-2,1.3395595752166811E-2]
[13,null,null,null,13,1.7003271941808496E-2,1.7506541044345646E-2]
[14,null,11,null,14,7.9352678435665944E-3,1.9711008413133668E-2]
{"$rows_left_out":19}
{"sheet":"tmpRankings","index":9,"n_rows":203,"n_cols":7,"rows_kept":203,"cut":false,"hidden":false,"merged":[]}
["ΑΜ","Ονοματεπώνυμο","Γεν.","Σύλλογος","Βαθμ"]
[25438,"ΤΣΙΤΣΙΠΑΣ ΣΤΕΦΑΝΟΣ",1998,"Ο.Α.ΓΛΥΦΑΔΑΣ",190,null,"=VLOOKUP(c3;tmpRankings!$A$2:$E$251;5;FALSE)"]
[23775,"ΑΝΤΩΝΟΠΟΥΛΟΣ ΧΡΗΣΤΟΣ",1998,"Ο.Α.ΚΕΡΑΤΣΙΝΙΟΥ",180]
[25875,"ΛΑΖΑΡΙΔΗΣ ΚΩΝΣΤΑΝΤΙΝΟΣ",1998,"Ε.Σ.Ο.ΕΠΙΚΟΥΡΟΣ ΠΟΛΙΧΝΗΣ",160]
[24845,"ΗΛΙΟΠΟΥΛΟΣ ΒΑΣΙΛΗΣ",1998,"Α.Ο.Α.ΦΙΛΟΘΕΗΣ",140]
[23517,"ΤΣΙΡΑΝΙΔΗΣ ΕΥΣΤΑΘΙΟΣ",1998,"Ο.Α.ΤΟΥΜΠΑΣ",140]
[25297,"ΚΑΠΙΡΗΣ ΣΤΑΜΑΤΗΣ",1999,"Α.Ο.Α.ΦΙΛΟΘΕΗΣ",61]
[26190,"ΑΝΔΡΩΝΗΣ ΙΩΑΝΝΗΣ",1999,"Ο.Α.ΑΓΙΑΣ ΠΑΡΑΣΚΕΥΗΣ",60]
[22866,"ΚΟΝΤΟΠΟΥΛΟΣ ΘΕΟΦΑΝΗΣ",1998,"Ο.Α.ΚΟΡΙΝΘΟΥ",60]
[25296,"ΣΠΑΘΗΣ ΜΑΡΙΝΟΣ",1998,"Α.Ο.Α.ΗΛΙΟΥΠΟΛΗΣ",60]
[24516,"ΒΟΪΝΕΑ ΑΛΕΞΑΝΔΡΟΣ",1998,"Ο.Α.ΒΟΥΛΙΑΓΜΕΝΗΣ ΜΙΚΡΟΙ ΑΣΣΟΙ",58]
[26317,"ΚΩΣΤΑΡΑΣ ΠΑΝΑΓΙΩΤΗΣ",1999,"Ο.Α.ΠΕΤΡΟΥΠΟΛΗΣ",58]
[26297,"ΑΓΙΟΥΣ ΓΕΩΡΓΙΟΣ",1999,"ΚΕΡΚΥΡΑΪΚΗ Λ.Τ.",56]
[23040,"ΚΑΤΣΑΛΗΣ ΚΩΝΣΤΑΝΤΙΝΟΣ",1998,"Α.Σ.Α.ΛΑΡΙΣΑΣ",55]
[30054,"ΣΑΚΕΛΛΑΡΙΔΗΣ ΜΙΧΑΛΗΣ",2001,"Ο.Α.ΑΓΙΑΣ ΠΑΡΑΣΚΕΥΗΣ",53]
{"$rows_left_out":188}