{"text_format":"1","workbook":"xlsx","n_sheets":9,"sheets":["Setup","DrawPrep","Draw","PrgPrep","Day1","Day2","notes","tmp","tmpRankings"],"not_rendered":{"charts":0,"images":0,"macros":1,"external_links":0,"defined_names":1,"comments":1,"pivot_tables":0},"unopened":[],"bounds":{"document_bytes":16777216,"sheet_cells":100000,"rows_first":2000,"rows_last":500,"rows_between":2000,"halvings":0,"cell_chars":16384,"cell_head_chars":4096},"cells_cut":0,"cells_raw":0,"read":"whole","date_system":"1900"}

{"sheet":"Setup","index":0,"n_rows":34,"n_cols":12,"rows_kept":34,"cut":false,"hidden":false,"merged":[[1,3,2,3],[4,3,7,3]]}
["ΤΟΥΡΝΟΥΑ 32άρι ταμπλό",null,null,"Θέσεις","seed",null,null,0,"seed","space pos","Index","Value"]
[null,null,null,"3-4",{"$f":"VALUE(LEFT(F2,1))","v":4},"4 3",null,{"$f":"IF(I2=\"-\",\"-\",IF(I2>0,H1+1,0))","v":0},{"$f":"IF(J2>0,VALUE(MID($A$32,1,J2-1)),\"-\")","v":0},{"$f":"IF(LEN($A$32)>1,FIND(\" \",$A$32,1),0)","v":2},0,0]
["Διοργανωτής: ","ΕΦΟΑ",null,null,{"$f":"VALUE(RIGHT(F2,1))","v":3},null,null,0,{"$f":"IF(J3>0,VALUE(MID($A$32,J2+1,J3-J2-1)),\"-\")","v":0},{"$f":"IF(AND(J2>0,LEN($A$32)>J2+1),FIND(\" \",$A$32,J2+1),0)","v":4},0,0]
["Τίτλος Τουρνουά: ","5ο Ε3",null,"Θέσεις","seed",null,null,0,0,6,0,0]
["type: ","e1-16",null,"5-8",{"$f":"TRIM(LEFT(F5,(FIND(\" \",F5,1)-1)))","v":"7"},"7 6 8 5",null,0,0,8,0,0]
["Έδρα αγώνων: ","A.O. ΒΑΡΗΣ ΑΝΑΓΥΡΟΥΣ",null,null,{"$f":"TRIM(MID(F5,(FIND(\" \",F5,1)),FIND(\" \",F5,(FIND(\" \",F5,1)+1))-(FIND(\" \",F5,1))))","v":"6"},null,null,0,0,10,0,0]
["Κατηγορίες: ","Κ14",null,null,{"$f":"TRIM(MID(F5, (FIND(\" \",F5,(FIND(\" \",F5,1)+1))+1), (FIND(\" \",F5,(FIND(\" \",F5,(FIND(\" \",F5,1)+1))+1)))-(FIND(\" \",F5,(FIND(\" \",F5,1)+1))+1)))","v":"8"},null,null,0,0,12,0,0]
["Έναρξη: ","18",null,null,{"$f":"TRIM(RIGHT(F5,LEN(F5)-(FIND(\" \",F5,(FIND(\" \",F5,(FIND(\" \",F5,1)+1))+1)))))","v":"5"},null,null,0,0,14,0,0]
["Λήξη: ","20 Νοεμβρίου",null,null,null,null,null,0,0,16,0,0]
["Επιδιατητής: ","Πατσουράκου Δώρα",null,null,null,null,null,0,0,18,0,0]
["Τηλέφωνο επιδ: ",null,null,null,null,null,null,0,{"$f":"IF(J11>0,VALUE(MID($A$32,J10+1,J11-J10-1)),\"-\")","v":0},20,0,0]
[null,null,null,null,null,null,null,{"$f":"IF(I12=\"-\",\"-\",IF(I12>0,H11+1,0))","v":0},0,22,0,0]
[null,null,null,null,null,null,null,0,0,24,0,0]
[null,null,null,null,null,null,null,0,0,26,0,0]
[null,null,null,null,null,null,null,0,0,28,0,0]
{"$rows_left_out":20}
{"sheet":"DrawPrep","index":1,"n_rows":43,"n_cols":11,"rows_kept":43,"cut":false,"hidden":true,"merged":[[36,1,36,3],[0,0,0,6]]}
[{"$f":"Setup!$B$3 & \", \" & Setup!$B$4 & \", \" & Setup!$B$6 & \", \" & Setup!$B$8 & \"-\" & Setup!$B$9","v":"ΕΦΟΑ, 5ο Ε3, A.O. ΒΑΡΗΣ ΑΝΑΓΥΡΟΥΣ, 18-20 Νοεμβρίου"},null,null,null,null,null,null,{"$f":"Setup!B7","v":"Κ14"}]
["α/α","από","Α.Μ.","Ονοματεπώνυμο","Σύλλογος","βαθμοί","Τηλέφωνο","Υπογραφή","SortPts","Rnd","trim"]
[1,null,33920,"ΠΛΑΤΣΙΩΤΑ ΡΑΦΑΕΛΑ","Α.Ο.Α.ΑΤΤΙΚΟΣ ΗΛΙΟΣ",66,null,null,{"$f":"IF(D3>\" \",F3+J3,0)","v":66.00260297569308},2.6029756930769118E-3,{"$f":"TRIM(D3)","v":"ΠΛΑΤΣΙΩΤΑ ΡΑΦΑΕΛΑ"}]
[2,null,35645,"ΜΠΑΞΟΠΟΥΛΟΥ ΔΕΣΠΟΙΝΑ","ΠΕΥΚΗ Γ.ΚΑΛΟΒΕΛΩΝΗΣ",59,null,null,59.003279305256342,3.2793052563453253E-3,"ΜΠΑΞΟΠΟΥΛΟΥ ΔΕΣΠΟΙΝΑ"]
[3,null,34938,"ΚΑΡΑΟΥΖΑ ΣΙΜΟΝ-ΜΑΡΙΑ","Σ.Α.ΡΑΦΗΝΑΣ",50.5,null,null,50.500558471588676,5.5847158867374826E-4,"ΚΑΡΑΟΥΖΑ ΣΙΜΟΝ-ΜΑΡΙΑ"]
[4,null,34304,"ΚΟΥΡΟΥΚΛΗ ΑΛΕΞΑΝΔΡΑ","Ο.Α.ΑΘΗΝΩΝ",44.5,null,null,44.502515920705378,2.515920705374475E-3,"ΚΟΥΡΟΥΚΛΗ ΑΛΕΞΑΝΔΡΑ"]
[5,null,35976,"ΠΑΠΑΠΑΝΑΓΙΩΤΟΥ ΗΔΥΛΗ-ΜΑΡΙΑ","Α.Ο.Α.ΑΤΤΙΚΟΣ ΗΛΙΟΣ",44.5,null,null,44.500383851985859,3.83851985860545E-4,"ΠΑΠΑΠΑΝΑΓΙΩΤΟΥ ΗΔΥΛΗ-ΜΑΡΙΑ"]
[6,null,34244,"ΜΑΥΡΟΜΑΤΗ ΜΑΡΙΑ","Α.Σ.ΑΚΡΟΠΟΛΙΣ",43.5,null,null,43.503386577432835,3.3865774328357724E-3,"ΜΑΥΡΟΜΑΤΗ ΜΑΡΙΑ"]
[7,null,33367,"ΚΑΤΣΟΥΔΑ ΑΣΠΑΣΙΑ","Ο.Α.ΣΥΡΟΥ",43,null,null,43.003379400280117,3.3794002801204774E-3,"ΚΑΤΣΟΥΔΑ ΑΣΠΑΣΙΑ"]
[8,null,35150,"ΠΙΣΛΗ ΕΙΡΗΝΗ","Α.Ο.Α.ΑΤΤΙΚΟΣ ΗΛΙΟΣ",40.5,null,null,40.504273208664138,4.2732086641412096E-3,"ΠΙΣΛΗ ΕΙΡΗΝΗ"]
[9,null,27518,"ΚΟΥΛΟΚΥΘΑ ΣΗΜΕΛΑ-ΑΡΕΤΗ","Σ.Α.ΡΑΦΗΝΑΣ",38,null,null,38.004217574818917,4.2175748189157997E-3,"ΚΟΥΛΟΚΥΘΑ ΣΗΜΕΛΑ-ΑΡΕΤΗ"]
[10,null,35699,"ΚΩΛΕΤΣΗ ΑΙΚΑΤΕΡΙΝΗ","Α.Κ.Α.ΜΑΡΑΘΩΝΑ",38,null,null,38.001229137360106,1.2291373601051256E-3,"ΚΩΛΕΤΣΗ ΑΙΚΑΤΕΡΙΝΗ"]
[11,null,34303,"ΚΟΥΡΟΥΚΛΗ ΑΝΝΑ","Ο.Α.ΑΘΗΝΩΝ",31,null,null,31.000974995285066,9.7499528506681302E-4,"ΚΟΥΡΟΥΚΛΗ ΑΝΝΑ"]
[12,null,35916,"ΚΕΦΑΛΑ ΑΝΝΑ","Α.Κ.Α.ΜΑΡΑΘΩΝΑ",28.5,null,null,28.504222237882047,4.2222378820473989E-3,"ΚΕΦΑΛΑ ΑΝΝΑ"]
[13,null,37647,"ΠΑΠΑΓΕΩΡΓΙΟΥ ΕΛΕΑΝΝΑ","Α.Ο.ΑΤΛΑΝΤΙΣ",18,null,null,18.00137516685799,1.3751668579902452E-3,"ΠΑΠΑΓΕΩΡΓΙΟΥ ΕΛΕΑΝΝΑ"]
{"$rows_left_out":29}
{"sheet":"Draw","index":2,"n_rows":67,"n_cols":20,"rows_kept":67,"cut":false,"hidden":false,"merged":[[0,0,0,17],[2,9,2,11],[41,17,41,19]]}
[{"$f":"Setup!B3 & \", \" & Setup!B4 & \", \" & Setup!B6 & \", \" & Setup!B8 & \"-\" & Setup!B9","v":"ΕΦΟΑ, 5ο Ε3, A.O. ΒΑΡΗΣ ΑΝΑΓΥΡΟΥΣ, 18-20 Νοεμβρίου"},null,null,null,null,null,null,null,null,null,null,null,null,null,null,null,null,null,null,{"$f":"Setup!B7","v":"Κ14"}]
[null,{"$f":"Setup!B18","v":15},null,null,null,null,null,null,"p1",null,null,null,null,"p2",null,"p3",null,"p4",null,"p5-6"]
[null,null,null,null,null,null,null,null,null,32,null,null,null,16,null,8,null,4,null,"2 & w"]
["α/α",null,"ByeOrder","ByeSum","ByeCnt","από","seed","Pts","Α.Μ.","Ονοματεπώνυμο","επώνυμο","Σύλλογος"]
[1,1,null,null,0,{"$f":"IF(NOT($G5=\"-\"),VLOOKUP($G5,DrawPrep!$A$3:$F$34,2,FALSE),\"\")","v":0},{"$f":"VLOOKUP($B5,Setup!$K$2:$L$33,2,FALSE)","v":1},{"$f":"IF($G5>0,VLOOKUP($G5,DrawPrep!$A$3:$F$34,6,FALSE),0)","v":66},{"$f":"IF(Setup!$B$24=\"#\",0,IF($G5>0,VLOOKUP($G5,DrawPrep!$A$3:$F$34,3,FALSE),0))","v":33920},{"$f":"IF($I5>0,VLOOKUP($I5,DrawPrep!$C$3:$F$34,2,FALSE),\"bye\")","v":"ΠΛΑΤΣΙΩΤΑ ΡΑΦΑΕΛΑ"},{"$f":"IF(NOT(I5>0),\"\", IF(ISERROR(FIND(\"-\",J5)), LEFT(J5,FIND(\" \",J5)-1), IF(FIND(\"-\",J5)>FIND(\" \",J5),LEFT(J5,FIND(\" \",J5)-1), LEFT(J5,FIND(\"-\",J5)-1) )))","v":"ΠΛΑΤΣΙΩΤΑ"},{"$f":"IF($I5>0,VLOOKUP($I5,DrawPrep!$C$3:$F$34,3,FALSE),\"\")","v":"Α.Ο.Α.ΑΤΤΙΚΟΣ ΗΛΙΟΣ"},1,{"$f":"UPPER(IF($A$2=\"R\",IF(OR(M5=1,M5=\"a\"),I5,IF(OR(M5=2,M5=\"b\"),I6,\"\")),IF(OR(M5=1,M5=\"1\"),K5,IF(OR(M5=2,M5=\"b\"),K6,\"\"))))","v":"ΠΛΑΤΣΙΩΤΑ"}]
[2,{"$f":"1-D6+8","v":8},{"$f":"B5","v":1},{"$f":"E6","v":1},{"$f":"IF($B$2>=C6,1,0)","v":1},{"$f":"IF(NOT($G6=\"-\"),VLOOKUP($G6,DrawPrep!$A$3:$F$34,2,FALSE),\"\")","v":""},{"$f":"IF($B$2>=C6,\"-\",VLOOKUP($B6,Setup!$K$2:$L$33,2,FALSE))","v":"-"},{"$f":"IF(NOT($G6=\"-\"),VLOOKUP($G6,DrawPrep!$A$3:$F$34,6,FALSE),0)","v":0},{"$f":"IF(Setup!$B$24=\"#\",0,IF(NOT($G6=\"-\"),VLOOKUP($G6,DrawPrep!$A$3:$F$34,3,FALSE),0))","v":0},{"$f":"IF($I6>0,VLOOKUP($I6,DrawPrep!$C$3:$F$34,2,FALSE),\"bye\")","v":"bye"},{"$f":"IF(NOT(I6>0),\"\", IF(ISERROR(FIND(\"-\",J6)), LEFT(J6,FIND(\" \",J6)-1), IF(FIND(\"-\",J6)>FIND(\" \",J6),LEFT(J6,FIND(\" \",J6)-1), LEFT(J6,FIND(\"-\",J6)-1) )))","v":""},{"$f":"IF($I6>0,VLOOKUP($I6,DrawPrep!$C$3:$F$34,3,FALSE),\"\")","v":""},null,null,1,{"$f":"UPPER(IF($A$2=\"R\",IF(OR(O6=1,O6=\"a\"),N5,IF(OR(O6=2,O6=\"b\"),N7,\"\")),IF(OR(O6=1,O6=\"a\"),N5,IF(OR(O6=2,O6=\"b\"),N7,\"\"))))","v":"ΠΛΑΤΣΙΩΤΑ"}]
[3,{"$f":"2-D7+8","v":9},null,{"$f":"D6+E7","v":1},0,{"$f":"IF(NOT($G7=\"-\"),VLOOKUP($G7,DrawPrep!$A$3:$F$34,2,FALSE),\"\")","v":0},{"$f":"VLOOKUP($B7,Setup!$K$2:$L$33,2,FALSE)","v":14},{"$f":"IF($G7>0,VLOOKUP($G7,DrawPrep!$A$3:$F$34,6,FALSE),0)","v":17},{"$f":"IF(Setup!$B$24=\"#\",0,IF($G7>0,VLOOKUP($G7,DrawPrep!$A$3:$F$34,3,FALSE),0))","v":35159},{"$f":"IF($I7>0,VLOOKUP($I7,DrawPrep!$C$3:$F$34,2,FALSE),\"bye\")","v":"ΕΥΘΥΜΙΑΔΗ ΝΤΟΡΙΑΝΝΑ"},"ΕΥΘΥΜΙΑΔΗ",{"$f":"IF($I7>0,VLOOKUP($I7,DrawPrep!$C$3:$F$34,3,FALSE),\"\")","v":"Α.Ο.Α.ΑΤΤΙΚΟΣ ΗΛΙΟΣ"},1,{"$f":"UPPER(IF($A$2=\"R\",IF(OR(M7=1,M7=\"a\"),I7,IF(OR(M7=2,M7=\"b\"),I8,\"\")),IF(OR(M7=1,M7=\"a\"),K7,IF(OR(M7=2,M7=\"b\"),K8,\"\"))))","v":"ΕΥΘΥΜΙΑΔΗ"},null,"61 62"]
[4,{"$f":"3-D8+8","v":9},15,{"$f":"D7+E8","v":2},{"$f":"IF($B$2>=C8,1,0)","v":1},{"$f":"IF(NOT($G8=\"-\"),VLOOKUP($G8,DrawPrep!$A$3:$F$34,2,FALSE),\"\")","v":""},{"$f":"IF($B$2>=C8,\"-\",VLOOKUP($B8,Setup!$K$2:$L$33,2,FALSE))","v":"-"},{"$f":"IF(NOT($G8=\"-\"),VLOOKUP($G8,DrawPrep!$A$3:$F$34,6,FALSE),0)","v":0},{"$f":"IF(Setup!$B$24=\"#\",0,IF(NOT($G8=\"-\"),VLOOKUP($G8,DrawPrep!$A$3:$F$34,3,FALSE),0))","v":0},{"$f":"IF($I8>0,VLOOKUP($I8,DrawPrep!$C$3:$F$34,2,FALSE),\"bye\")","v":"bye"},"",{"$f":"IF($I8>0,VLOOKUP($I8,DrawPrep!$C$3:$F$34,3,FALSE),\"\")","v":""},null,null,null,null,null,{"$f":"UPPER(IF($A$2=\"R\",IF(OR(Q8=1,Q8=\"a\"),P6,IF(OR(Q8=2,Q8=\"b\"),P10,\"\")),IF(OR(Q8=1,Q8=\"a\"),P6,IF(OR(Q8=2,Q8=\"b\"),P10,\"\"))))","v":""}]
[5,{"$f":"4-D9+8","v":10},null,2,0,{"$f":"IF(NOT($G9=\"-\"),VLOOKUP($G9,DrawPrep!$A$3:$F$34,2,FALSE),\"\")","v":0},{"$f":"VLOOKUP($B9,Setup!$K$2:$L$33,2,FALSE)","v":13},{"$f":"IF($G9>0,VLOOKUP($G9,DrawPrep!$A$3:$F$34,6,FALSE),0)","v":18},{"$f":"IF(Setup!$B$24=\"#\",0,IF($G9>0,VLOOKUP($G9,DrawPrep!$A$3:$F$34,3,FALSE),0))","v":37647},{"$f":"IF($I9>0,VLOOKUP($I9,DrawPrep!$C$3:$F$34,2,FALSE),\"bye\")","v":"ΠΑΠΑΓΕΩΡΓΙΟΥ ΕΛΕΑΝΝΑ"},"ΠΑΠΑΓΕΩΡΓΙΟΥ",{"$f":"IF($I9>0,VLOOKUP($I9,DrawPrep!$C$3:$F$34,3,FALSE),\"\")","v":"Α.Ο.ΑΤΛΑΝΤΙΣ"},1,{"$f":"UPPER(IF($A$2=\"R\",IF(OR(M9=1,M9=\"a\"),I9,IF(OR(M9=2,M9=\"b\"),I10,\"\")),IF(OR(M9=1,M9=\"a\"),K9,IF(OR(M9=2,M9=\"b\"),K10,\"\"))))","v":"ΠΑΠΑΓΕΩΡΓΙΟΥ"}]
[6,{"$f":"5-D10+8","v":10},9,3,{"$f":"IF($B$2>=C10,1,0)","v":1},{"$f":"IF(NOT($G10=\"-\"),VLOOKUP($G10,DrawPrep!$A$3:$F$34,2,FALSE),\"\")","v":""},{"$f":"IF($B$2>=C10,\"-\",VLOOKUP($B10,Setup!$K$2:$L$33,2,FALSE))","v":"-"},{"$f":"IF(NOT($G10=\"-\"),VLOOKUP($G10,DrawPrep!$A$3:$F$34,6,FALSE),0)","v":0},{"$f":"IF(Setup!$B$24=\"#\",0,IF(NOT($G10=\"-\"),VLOOKUP($G10,DrawPrep!$A$3:$F$34,3,FALSE),0))","v":0},{"$f":"IF($I10>0,VLOOKUP($I10,DrawPrep!$C$3:$F$34,2,FALSE),\"bye\")","v":"bye"},"",{"$f":"IF($I10>0,VLOOKUP($I10,DrawPrep!$C$3:$F$34,3,FALSE),\"\")","v":""},null,null,2,{"$f":"UPPER(IF($A$2=\"R\",IF(OR(O10=1,O10=\"a\"),N9,IF(OR(O10=2,O10=\"b\"),N11,\"\")),IF(OR(O10=1,O10=\"a\"),N9,IF(OR(O10=2,O10=\"b\"),N11,\"\"))))","v":"ΚΑΤΣΟΥΔΑ"}]
[7,{"$f":"6-D11+8","v":10},{"$f":"B12","v":7},4,{"$f":"IF($B$2>=C11,1,0)","v":1},{"$f":"IF(NOT($G11=\"-\"),VLOOKUP($G11,DrawPrep!$A$3:$F$34,2,FALSE),\"\")","v":""},{"$f":"IF($B$2>=C11,\"-\",VLOOKUP($B11,Setup!$K$2:$L$33,2,FALSE))","v":"-"},{"$f":"IF(NOT($G11=\"-\"),VLOOKUP($G11,DrawPrep!$A$3:$F$34,6,FALSE),0)","v":0},{"$f":"IF(Setup!$B$24=\"#\",0,IF(NOT($G11=\"-\"),VLOOKUP($G11,DrawPrep!$A$3:$F$34,3,FALSE),0))","v":0},{"$f":"IF($I11>0,VLOOKUP($I11,DrawPrep!$C$3:$F$34,2,FALSE),\"bye\")","v":"bye"},"",{"$f":"IF($I11>0,VLOOKUP($I11,DrawPrep!$C$3:$F$34,3,FALSE),\"\")","v":""},2,{"$f":"UPPER(IF($A$2=\"R\",IF(OR(M11=1,M11=\"a\"),I11,IF(OR(M11=2,M11=\"b\"),I12,\"\")),IF(OR(M11=1,M11=\"a\"),K11,IF(OR(M11=2,M11=\"b\"),K12,\"\"))))","v":"ΚΑΤΣΟΥΔΑ"},null,"60 60"]
[8,{"$f":"VALUE(Setup!E5)","v":7},null,4,0,{"$f":"IF(NOT($G12=\"-\"),VLOOKUP($G12,DrawPrep!$A$3:$F$34,2,FALSE),\"\")","v":0},{"$f":"VLOOKUP($B12,Setup!$K$2:$L$33,2,FALSE)","v":7},{"$f":"IF($G12>0,VLOOKUP($G12,DrawPrep!$A$3:$F$34,6,FALSE),0)","v":43},{"$f":"IF(Setup!$B$24=\"#\",0,IF($G12>0,VLOOKUP($G12,DrawPrep!$A$3:$F$34,3,FALSE),0))","v":33367},{"$f":"IF($I12>0,VLOOKUP($I12,DrawPrep!$C$3:$F$34,2,FALSE),\"bye\")","v":"ΚΑΤΣΟΥΔΑ ΑΣΠΑΣΙΑ"},"ΚΑΤΣΟΥΔΑ",{"$f":"IF($I12>0,VLOOKUP($I12,DrawPrep!$C$3:$F$34,3,FALSE),\"\")","v":"Ο.Α.ΣΥΡΟΥ"},null,null,null,null,null,null,null,{"$f":"UPPER(IF($A$2=\"R\",IF(OR(S12=1,S12=\"a\"),R8,IF(OR(S12=2,S12=\"b\"),R16,\"\")),IF(OR(S12=1,S12=\"a\"),R8,IF(OR(S12=2,S12=\"b\"),R16,\"\"))))","v":""}]
[9,{"$f":"VALUE(Setup!E2)","v":4},null,4,0,{"$f":"IF(NOT($G13=\"-\"),VLOOKUP($G13,DrawPrep!$A$3:$F$34,2,FALSE),\"\")","v":0},{"$f":"VLOOKUP($B13,Setup!$K$2:$L$33,2,FALSE)","v":4},{"$f":"IF($G13>0,VLOOKUP($G13,DrawPrep!$A$3:$F$34,6,FALSE),0)","v":44.5},{"$f":"IF(Setup!$B$24=\"#\",0,IF($G13>0,VLOOKUP($G13,DrawPrep!$A$3:$F$34,3,FALSE),0))","v":34304},{"$f":"IF($I13>0,VLOOKUP($I13,DrawPrep!$C$3:$F$34,2,FALSE),\"bye\")","v":"ΚΟΥΡΟΥΚΛΗ ΑΛΕΞΑΝΔΡΑ"},"ΚΟΥΡΟΥΚΛΗ",{"$f":"IF($I13>0,VLOOKUP($I13,DrawPrep!$C$3:$F$34,3,FALSE),\"\")","v":"Ο.Α.ΑΘΗΝΩΝ"},1,{"$f":"UPPER(IF($A$2=\"R\",IF(OR(M13=1,M13=\"a\"),I13,IF(OR(M13=2,M13=\"b\"),I14,\"\")),IF(OR(M13=1,M13=\"a\"),K13,IF(OR(M13=2,M13=\"b\"),K14,\"\"))))","v":"ΚΟΥΡΟΥΚΛΗ"}]
[10,{"$f":"7-D14+8","v":10},{"$f":"B13","v":4},5,{"$f":"IF($B$2>=C14,1,0)","v":1},{"$f":"IF(NOT($G14=\"-\"),VLOOKUP($G14,DrawPrep!$A$3:$F$34,2,FALSE),\"\")","v":""},{"$f":"IF($B$2>=C14,\"-\",VLOOKUP($B14,Setup!$K$2:$L$33,2,FALSE))","v":"-"},{"$f":"IF(NOT($G14=\"-\"),VLOOKUP($G14,DrawPrep!$A$3:$F$34,6,FALSE),0)","v":0},{"$f":"IF(Setup!$B$24=\"#\",0,IF(NOT($G14=\"-\"),VLOOKUP($G14,DrawPrep!$A$3:$F$34,3,FALSE),0))","v":0},{"$f":"IF($I14>0,VLOOKUP($I14,DrawPrep!$C$3:$F$34,2,FALSE),\"bye\")","v":"bye"},"",{"$f":"IF($I14>0,VLOOKUP($I14,DrawPrep!$C$3:$F$34,3,FALSE),\"\")","v":""},null,null,2,{"$f":"UPPER(IF($A$2=\"R\",IF(OR(O14=1,O14=\"a\"),N13,IF(OR(O14=2,O14=\"b\"),N15,\"\")),IF(OR(O14=1,O14=\"a\"),N13,IF(OR(O14=2,O14=\"b\"),N15,\"\"))))","v":"ΚΟΥΡΟΥΚΛΗ"}]
[11,{"$f":"8-D15+8","v":11},null,5,0,{"$f":"IF(NOT($G15=\"-\"),VLOOKUP($G15,DrawPrep!$A$3:$F$34,2,FALSE),\"\")","v":0},{"$f":"VLOOKUP($B15,Setup!$K$2:$L$33,2,FALSE)","v":11},{"$f":"IF($G15>0,VLOOKUP($G15,DrawPrep!$A$3:$F$34,6,FALSE),0)","v":31},{"$f":"IF(Setup!$B$24=\"#\",0,IF($G15>0,VLOOKUP($G15,DrawPrep!$A$3:$F$34,3,FALSE),0))","v":34303},{"$f":"IF($I15>0,VLOOKUP($I15,DrawPrep!$C$3:$F$34,2,FALSE),\"bye\")","v":"ΚΟΥΡΟΥΚΛΗ ΑΝΝΑ"},"ΚΟΥΡΟΥΚΛΗ",{"$f":"IF($I15>0,VLOOKUP($I15,DrawPrep!$C$3:$F$34,3,FALSE),\"\")","v":"Ο.Α.ΑΘΗΝΩΝ"},1,{"$f":"UPPER(IF($A$2=\"R\",IF(OR(M15=1,M15=\"a\"),I15,IF(OR(M15=2,M15=\"b\"),I16,\"\")),IF(OR(M15=1,M15=\"a\"),K15,IF(OR(M15=2,M15=\"b\"),K16,\"\"))))","v":"ΚΟΥΡΟΥΚΛΗ"},null,"55 ret"]
{"$rows_left_out":53}
{"sheet":"PrgPrep","index":3,"n_rows":37,"n_cols":7,"rows_kept":37,"cut":false,"hidden":true,"merged":[[2,5,3,5],[21,5,22,5],[0,0,0,5],[1,0,1,5]]}
[{"$f":"Setup!B3 & \", \" & Setup!B4 & \", \" & Setup!B6  & \" (\" & Setup!B7 & \")\"","v":"ΕΦΟΑ, 5ο Ε3, A.O. ΒΑΡΗΣ ΑΝΑΓΥΡΟΥΣ (Κ14)"},null,null,null,null,null,"Don't Change this Worksheet !"]
[{"$f":"Setup!$B$10","v":"Πατσουράκου Δώρα"}]
["Πρόγραμμα αγώνων",null,null,null,"Round 1","i"]
["ΩΡΑ","Κτγρ.","Αθλητής-Σύλλογος",null,"Αθλητής-Σύλλογος"]
["Έναρξη",{"$f":"Setup!$B$7","v":"Κ14"},{"$f":"IF(OR(Draw!J5=\"bye\",Draw!J5=\"LWD\"),\"\",CONCATENATE(LEFT(Draw!J5,FIND(\" \",Draw!J5)+1),\" (\",Draw!L5,\")\"))","v":"ΠΛΑΤΣΙΩΤΑ Ρ (Α.Ο.Α.ΑΤΤΙΚΟΣ ΗΛΙΟΣ)"},{"$f":"IF(OR(C5=\"\",E5=\"\"),\" \",\"-\")","v":" "},{"$f":"IF(OR(Draw!J6=\"bye\",Draw!J6=\"LWD\"), \"\", CONCATENATE(LEFT(Draw!J6,FIND(\" \",Draw!J6)+1),\" (\",Draw!L6,\")\"))","v":""}]
[null,{"$f":"Setup!$B$7","v":"Κ14"},{"$f":"IF(OR(Draw!J7=\"bye\",Draw!J7=\"LWD\"),\"\",CONCATENATE(LEFT(Draw!J7,FIND(\" \",Draw!J7)+1),\" (\",Draw!L7,\")\"))","v":"ΕΥΘΥΜΙΑΔΗ Ν (Α.Ο.Α.ΑΤΤΙΚΟΣ ΗΛΙΟΣ)"},{"$f":"IF(OR(C6=\"\",E6=\"\"),\" \",\"-\")","v":" "},{"$f":"IF(OR(Draw!J8=\"bye\",Draw!J8=\"LWD\"), \"\", CONCATENATE(LEFT(Draw!J8,FIND(\" \",Draw!J8)+1),\" (\",Draw!L8,\")\"))","v":""}]
[null,{"$f":"Setup!$B$7","v":"Κ14"},{"$f":"IF(OR(Draw!J9=\"bye\",Draw!J9=\"LWD\"),\"\",CONCATENATE(LEFT(Draw!J9,FIND(\" \",Draw!J9)+1),\" (\",Draw!L9,\")\"))","v":"ΠΑΠΑΓΕΩΡΓΙΟΥ Ε (Α.Ο.ΑΤΛΑΝΤΙΣ)"}," ",{"$f":"IF(OR(Draw!J10=\"bye\",Draw!J10=\"LWD\"), \"\", CONCATENATE(LEFT(Draw!J10,FIND(\" \",Draw!J10)+1),\" (\",Draw!L10,\")\"))","v":""}]
[null,{"$f":"Setup!$B$7","v":"Κ14"},{"$f":"IF(OR(Draw!J11=\"bye\",Draw!J11=\"LWD\"),\"\",CONCATENATE(LEFT(Draw!J11,FIND(\" \",Draw!J11)+1),\" (\",Draw!L11,\")\"))","v":""}," ",{"$f":"IF(OR(Draw!J12=\"bye\",Draw!J12=\"LWD\"), \"\", CONCATENATE(LEFT(Draw!J12,FIND(\" \",Draw!J12)+1),\" (\",Draw!L12,\")\"))","v":"ΚΑΤΣΟΥΔΑ Α (Ο.Α.ΣΥΡΟΥ)"}]
["όχι πριν",{"$f":"Setup!$B$7","v":"Κ14"},{"$f":"IF(OR(Draw!J13=\"bye\",Draw!J13=\"LWD\"),\"\",CONCATENATE(LEFT(Draw!J13,FIND(\" \",Draw!J13)+1),\" (\",Draw!L13,\")\"))","v":"ΚΟΥΡΟΥΚΛΗ Α (Ο.Α.ΑΘΗΝΩΝ)"}," ",{"$f":"IF(OR(Draw!J14=\"bye\",Draw!J14=\"LWD\"), \"\", CONCATENATE(LEFT(Draw!J14,FIND(\" \",Draw!J14)+1),\" (\",Draw!L14,\")\"))","v":""}]
[null,{"$f":"Setup!$B$7","v":"Κ14"},{"$f":"IF(OR(Draw!J15=\"bye\",Draw!J15=\"LWD\"),\"\",CONCATENATE(LEFT(Draw!J15,FIND(\" \",Draw!J15)+1),\" (\",Draw!L15,\")\"))","v":"ΚΟΥΡΟΥΚΛΗ Α (Ο.Α.ΑΘΗΝΩΝ)"}," ",{"$f":"IF(OR(Draw!J16=\"bye\",Draw!J16=\"LWD\"), \"\", CONCATENATE(LEFT(Draw!J16,FIND(\" \",Draw!J16)+1),\" (\",Draw!L16,\")\"))","v":""}]
[null,{"$f":"Setup!$B$7","v":"Κ14"},{"$f":"IF(OR(Draw!J17=\"bye\",Draw!J17=\"LWD\"),\"\",CONCATENATE(LEFT(Draw!J17,FIND(\" \",Draw!J17)+1),\" (\",Draw!L17,\")\"))","v":"ΚΑΛΑΧΑΝΗ Σ (Α.Σ.ΚΟΛΛΕΓΙΟΥ ΝΤΕΡΗ)"}," ",{"$f":"IF(OR(Draw!J18=\"bye\",Draw!J18=\"LWD\"), \"\", CONCATENATE(LEFT(Draw!J18,FIND(\" \",Draw!J18)+1),\" (\",Draw!L18,\")\"))","v":""}]
[null,{"$f":"Setup!$B$7","v":"Κ14"},{"$f":"IF(OR(Draw!J19=\"bye\",Draw!J19=\"LWD\"),\"\",CONCATENATE(LEFT(Draw!J19,FIND(\" \",Draw!J19)+1),\" (\",Draw!L19,\")\"))","v":""}," ",{"$f":"IF(OR(Draw!J20=\"bye\",Draw!J20=\"LWD\"), \"\", CONCATENATE(LEFT(Draw!J20,FIND(\" \",Draw!J20)+1),\" (\",Draw!L20,\")\"))","v":"ΜΑΥΡΟΜΑΤΗ Μ (Α.Σ.ΑΚΡΟΠΟΛΙΣ)"}]
["όχι πριν",{"$f":"Setup!$B$7","v":"Κ14"},{"$f":"IF(OR(Draw!J21=\"bye\",Draw!J21=\"LWD\"),\"\",CONCATENATE(LEFT(Draw!J21,FIND(\" \",Draw!J21)+1),\" (\",Draw!L21,\")\"))","v":"ΠΙΣΛΗ Ε (Α.Ο.Α.ΑΤΤΙΚΟΣ ΗΛΙΟΣ)"}," ",{"$f":"IF(OR(Draw!J22=\"bye\",Draw!J22=\"LWD\"), \"\", CONCATENATE(LEFT(Draw!J22,FIND(\" \",Draw!J22)+1),\" (\",Draw!L22,\")\"))","v":""}]
[null,{"$f":"Setup!$B$7","v":"Κ14"},{"$f":"IF(OR(Draw!J23=\"bye\",Draw!J23=\"LWD\"),\"\",CONCATENATE(LEFT(Draw!J23,FIND(\" \",Draw!J23)+1),\" (\",Draw!L23,\")\"))","v":"ΚΩΛΕΤΣΗ Α (Α.Κ.Α.ΜΑΡΑΘΩΝΑ)"}," ",{"$f":"IF(OR(Draw!J24=\"bye\",Draw!J24=\"LWD\"), \"\", CONCATENATE(LEFT(Draw!J24,FIND(\" \",Draw!J24)+1),\" (\",Draw!L24,\")\"))","v":""}]
[null,{"$f":"Setup!$B$7","v":"Κ14"},{"$f":"IF(OR(Draw!J25=\"bye\",Draw!J25=\"LWD\"),\"\",CONCATENATE(LEFT(Draw!J25,FIND(\" \",Draw!J25)+1),\" (\",Draw!L25,\")\"))","v":"ΚΟΥΛΟΚΥΘΑ Σ (Σ.Α.ΡΑΦΗΝΑΣ)"}," ",{"$f":"IF(OR(Draw!J26=\"bye\",Draw!J26=\"LWD\"), \"\", CONCATENATE(LEFT(Draw!J26,FIND(\" \",Draw!J26)+1),\" (\",Draw!L26,\")\"))","v":""}]
{"$rows_left_out":23}
{"sheet":"Day1","index":4,"n_rows":20,"n_cols":6,"rows_kept":20,"cut":false,"hidden":true,"merged":[[2,5,3,5],[0,0,0,5],[1,0,1,5]]}
[{"$f":"Setup!B3 & \", \" & Setup!B4 & \", \" & Setup!B6  & \" (\" & Setup!B7 & \")\"","v":"ΕΦΟΑ, 5ο Ε3, A.O. ΒΑΡΗΣ ΑΝΑΓΥΡΟΥΣ (Κ14)"}]
[{"$f":"Setup!$B$10","v":"Πατσουράκου Δώρα"}]
["Πρόγραμμα αγώνων",null,null,null,"Round 1","i"]
["ΩΡΑ","Κτγρ.","Αθλητής-Σύλλογος",null,"Αθλητής-Σύλλογος"]
["Έναρξη","Κ14","ΠΛΑΤΣΙΩΤΑ Ρ (Α.Ο.Α.ΑΤΤΙΚΟΣ ΗΛΙΟΣ)"," ",""]
[null,"Κ14","ΕΥΘΥΜΙΑΔΗ Ν (Α.Ο.Α.ΑΤΤΙΚΟΣ ΗΛΙΟΣ)"," ",""]
[null,"Κ14","ΠΑΠΑΓΕΩΡΓΙΟΥ Ε (Α.Ο.ΑΤΛΑΝΤΙΣ)"," ",""]
[null,"Κ14",""," ","ΚΑΤΣΟΥΔΑ Α (Ο.Α.ΣΥΡΟΥ)"]
[null,"Κ14","ΚΟΥΡΟΥΚΛΗ Α (Ο.Α.ΑΘΗΝΩΝ)"," ",""]
["όχι πριν","Κ14","ΚΟΥΡΟΥΚΛΗ Α (Ο.Α.ΑΘΗΝΩΝ)"," ",""]
[null,"Κ14","ΚΑΛΑΧΑΝΗ Σ (Α.Σ.ΚΟΛΛΕΓΙΟΥ ΝΤΕΡΗ)"," ",""]
[null,"Κ14",""," ","ΜΑΥΡΟΜΑΤΗ Μ (Α.Σ.ΑΚΡΟΠΟΛΙΣ)"]
[null,"Κ14","ΠΙΣΛΗ Ε (Α.Ο.Α.ΑΤΤΙΚΟΣ ΗΛΙΟΣ)"," ",""]
[null,"Κ14","ΚΩΛΕΤΣΗ Α (Α.Κ.Α.ΜΑΡΑΘΩΝΑ)"," ",""]
["όχι πριν","Κ14","ΚΟΥΛΟΚΥΘΑ Σ (Σ.Α.ΡΑΦΗΝΑΣ)"," ",""]
{"$rows_left_out":6}
{"sheet":"Day2","index":5,"n_rows":20,"n_cols":6,"rows_kept":20,"cut":false,"hidden":true,"merged":[[0,0,0,5],[1,0,1,5],[2,5,3,5]]}
[{"$f":"Setup!B3 & \", \" & Setup!B4 & \", \" & Setup!B6  & \" (\" & Setup!B7 & \")\"","v":"ΕΦΟΑ, 5ο Ε3, A.O. ΒΑΡΗΣ ΑΝΑΓΥΡΟΥΣ (Κ14)"}]
[{"$f":"Setup!$B$10","v":"Πατσουράκου Δώρα"}]
["Πρόγραμμα αγώνων",null,null,null,"Round 1","i"]
["ΩΡΑ","Κτγρ.","Αθλητής-Σύλλογος",null,"Αθλητής-Σύλλογος"]
["Έναρξη","Κ14","ΠΛΑΤΣΙΩΤΑ Ρ (Α.Ο.Α.ΑΤΤΙΚΟΣ ΗΛΙΟΣ)","-","ΕΥΘΥΜΙΑΔΗ Ν (Α.Ο.Α.ΑΤΤΙΚΟΣ ΗΛΙΟΣ)"]
[null,"Κ14","ΠΑΠΑΓΕΩΡΓΙΟΥ Ε (Α.Ο.ΑΤΛΑΝΤΙΣ)","-","ΚΑΤΣΟΥΔΑ Α (Ο.Α.ΣΥΡΟΥ)"]
[null,"Κ14","ΚΟΥΡΟΥΚΛΗ Α (Ο.Α.ΑΘΗΝΩΝ)","-","ΚΟΥΡΟΥΚΛΗ Α (Ο.Α.ΑΘΗΝΩΝ)"]
[null,"Κ14","ΚΑΛΑΧΑΝΗ Σ (Α.Σ.ΚΟΛΛΕΓΙΟΥ ΝΤΕΡΗ)","-","ΜΑΥΡΟΜΑΤΗ Μ (Α.Σ.ΑΚΡΟΠΟΛΙΣ)"]
[null,"Κ14","ΠΙΣΛΗ Ε (Α.Ο.Α.ΑΤΤΙΚΟΣ ΗΛΙΟΣ)","-","ΚΩΛΕΤΣΗ Α (Α.Κ.Α.ΜΑΡΑΘΩΝΑ)"]
["όχι πριν","Κ14","ΚΟΥΛΟΚΥΘΑ Σ (Σ.Α.ΡΑΦΗΝΑΣ)","-","ΚΑΡΑΟΥΖΑ Σ (Σ.Α.ΡΑΦΗΝΑΣ)"]
[null,"Κ14","ΠΑΠΑΠΑΝΑΓΙΩΤΟΥ Η (Α.Ο.Α.ΑΤΤΙΚΟΣ ΗΛΙΟΣ)","-","ΑΝΑΓΝΩΣΤΟΠΟΥΛΟΥ Ε (Α.Μ.Ε.Σ.Ν.ΕΡΥΘΡΑΙΑΣ)"]
[null,"Κ14","ΚΕΦΑΛΑ Α (Α.Κ.Α.ΜΑΡΑΘΩΝΑ)","-","ΜΠΑΞΟΠΟΥΛΟΥ Δ (ΠΕΥΚΗ Γ.ΚΑΛΟΒΕΛΩΝΗΣ)"]
[]
[]
[]
{"$rows_left_out":6}
{"sheet":"notes","index":6,"n_rows":0,"n_cols":0,"rows_kept":0,"cut":false,"hidden":true,"merged":[]}

{"sheet":"tmp","index":7,"n_rows":34,"n_cols":24,"rows_kept":34,"cut":false,"hidden":true,"merged":[[0,8,0,23],[1,16,1,17],[2,8,5,8],[2,16,5,16],[6,8,8,8],[6,16,8,16],[11,8,11,23],[12,16,12,17],[13,8,16,8],[13,16,16,16],[17,8,19,8],[17,16,19,16],[31,9,33,9],[31,16,33,16],[20,8,22,8],[20,16,22,16],[25,9,25,22],[26,9,26,10],[26,16,26,17],[27,9,30,9],[27,16,30,16]]}
["RndIndx","random","FixRandom",null,"α/α","seed","ByeOrder",null,"ΠΡΟΚΡΙΜΑΤΙΚΑ E1, E2 (32 για 8)"]
[1,{"$f":"RAND()/222","v":1.8412213124151563E-3},2.6029756930769118E-3,null,1,1,null,null,null,null,"17-32","9-16","5-8","3-4","2ος","1ος",null,null,"17-32","9-16","5-8","3-4","2ος","1ος"]
[2,3.7444870952762525E-3,3.2793052563453253E-3,null,2,null,1,null,"E1","E1-12",1,2,2,0,0,0,"E1","E1-12",1,1,0,0,0,0]
[3,{"$f":"RAND()/222","v":2.8564573563348689E-3},2.515920705374475E-3,null,3,null,null,null,null,"E1-14",3,4,4,0,0,0,null,"E1-14",3,1,0,0,0,0]
[4,{"$f":"RAND()/222","v":1.5904950479122234E-3},3.3794002801204774E-3,null,4,null,15,null,null,"E1-16",6,8,8,0,0,0,null,"E1-16",6,2,0,0,0,0]
[5,{"$f":"RAND()/222","v":4.1140319040281394E-3},4.2732086641412096E-3,null,5,null,null,null,null,"E1-18",7.5,10,10,null,null,null,null,"E1-18",7.5,2.5,0,0,0,0]
[6,{"$f":"RAND()/222","v":4.4186745590568018E-3},1.2291373601051256E-3,null,6,null,9,null,"E2","E2-12",0.3,0.5,0.5,0,0,0,"E2","E2-12",0.3,0.2,0,0,0,0]
[7,{"$f":"RAND()/222","v":3.6252814995557589E-3},9.7499528506681302E-4,null,7,null,5,null,null,"E2-14",1,2,2,0,0,0,null,"E2-14",1,1,0,0,0,0]
[8,2.0634813289163879E-3,4.2222378820473989E-3,null,8,5,null,null,null,"E2-16",2,4,4,0,0,0,null,"E2-16",2,2,0,0,0,0]
[9,3.0632944917563922E-4,1.3751668579902452E-3,null,9,3]
[10,4.4549527391430409E-3,2.5805156058947352E-3,null,10,null,3]
[11,4.4100231514893557E-3,3.1101701513897954E-3,null,11,null,null,null,"ΚΥΡΙΩΣ ΤΑΜΠΛΟ E1, E2 & E3"]
[12,2.6095044912613722E-3,3.816164705659006E-3,null,12,null,13,null,null,null,"17-32","9-16","5-8","3-4","2ος","1ος",null,null,"17-32","9-16","5-8","3-4","2ος","1ος"]
[13,6.1245041431351802E-4,3.3865774328357724E-3,null,13,null,null,null,"E1","E1-12",7,10,14,21,35,42,"E1","E1-12",7,3,4,7,14,7]
[14,3.080198420295702E-3,2.9189324037269459E-3,null,14,null,11,null,null,"E1-14",10,15,20,30,50,60,null,"E1-14",10,5,5,10,20,10]
{"$rows_left_out":20}
{"sheet":"tmpRankings","index":8,"n_rows":2,"n_cols":7,"rows_kept":2,"cut":false,"hidden":true,"merged":[]}
["ΑΜ","Ονοματεπώνυμο","Γεν.","Σύλλογος","Βαθμ"]
[null,null,null,null,null,null,"=VLOOKUP(c3;tmpRankings!$A$2:$E$251;3;FALSE)"]